Buscar
 
 

Resultados por:
 


Rechercher Búsqueda avanzada

Navegación
 Índice
 Wiki
 FAQ del foro
 FAQ del VDR-NG-EM
 Funcionalidades del VDR
 Mejoras del VDR-NG-EM
 Primeros pasos FW-VDR
 Descargas VDR-NG-EM
Flujo RSS


Yahoo! 
MSN 
AOL 
Netvibes 
Bloglines 



Error compilación en linux 64 bits

Ver el tema anterior Ver el tema siguiente Ir abajo

Error compilación en linux 64 bits

Mensaje por pjllaneras el Dom 13 Sep 2009 - 20:32

Estaba impaciente para probar el nuevo firm... y como lo primero es lo primero, tocaba compilar.

Primero comento que he cambiado el ordenador... ahora tengo una "pequeña bestia", un Core2Quad (Q8300) con 4Gb de RAM y 1Tb de disco. Para aprovechar el hardware le he instalado una Ubuntu-9.04-desktop-amd64. Decir que vuela es poco.

He seguido los pasos de la wiki para compilar en Linux, y parecía que todo iba bien, hasta que ha llegado el fatal momento... al final me ha dado este error:

Código:

configure: WARNING: unrecognized options: --with-gcc-version-trigger, --with-headers, --enable-languages, --disable-nls
configure: WARNING: If you wanted to set the --build type, don't use --host.
    If a cross compiler is detected then cross compile mode will be used.
configure: loading cache ../config.cache
checking build system type... Invalid configuration `x86_64-unknown-linux-gnu': machine `x86_64-unknown' not recognized
configure: error: /bin/bash /home/pjllaneras/vdr/VDR-NG-EM/VDR-NG-FW/build/egcs-1.1.2/gcc/../config.sub x86_64-unknown-linux-gnu failed
make[2]: Leaving directory `/home/pjllaneras/vdr/VDR-NG-EM/VDR-NG-FW/build/egcs.build/gcc'
make[2]: *** [config.status] Error 1
make[1]: *** [all-gcc] Error 2
make[1]: Leaving directory `/home/pjllaneras/vdr/VDR-NG-EM/VDR-NG-FW/build/egcs.build'
make: *** [/home/pjllaneras/vdr/VDR-NG-EM/VDR-NG-FW/m7x0_xtc_uclibc_Linux-x86_64/stagefiles/.egcs_compiled] Error 2

Por los mensajes parece que el problema es que mi Ubuntu es 64bits.

Ahora estoy un poco perdido... bueno, seguiré investigando por si encuentra una solución a esto y si alguien sabe como puedo resolverlo, mucho mejor.
avatar
pjllaneras
Betatester

Cantidad de envíos : 569
Fecha de inscripción : 29/01/2009
Edad : 45
Localización : Palma de Mallorca

Ver perfil de usuario

Volver arriba Ir abajo

Re: Error compilación en linux 64 bits

Mensaje por axel2 el Lun 14 Sep 2009 - 9:00

Yo he compilado con Ubuntu 64 sobre Vista en WMware y no me daba ese error.

No llegue al final de la compilación por errores de archivo(mal descargados) pero no de cia nada si era X86 o X64.

Dew
avatar
axel2
Betatester

Cantidad de envíos : 392
Fecha de inscripción : 04/02/2009
Edad : 54
Localización : Castelldefels, Catalunya

Ver perfil de usuario

Volver arriba Ir abajo

Re: Error compilación en linux 64 bits

Mensaje por pjllaneras el Lun 14 Sep 2009 - 10:12

Este error me lo da casi al final... cuando ya ha descargado los archivos necesarios, no recuerdo muy bien el tiempo (lo miraré en el log), pero debía llevar 1 hora compilando.

De momento no he encontrado información que me ayude a determinar cual puede ser realmente el problema y como solucionarlo...

Sería interesante confirmar si alguien ha podido compilar en un Linux 64bits.
avatar
pjllaneras
Betatester

Cantidad de envíos : 569
Fecha de inscripción : 29/01/2009
Edad : 45
Localización : Palma de Mallorca

Ver perfil de usuario

Volver arriba Ir abajo

Re: Error compilación en linux 64 bits

Mensaje por zjuanma el Lun 14 Sep 2009 - 13:43

cuando te compile, si quereis acelerar la compilacion lanzar el make con -jnumero_de_procesadores, y veras como usa todos los nucleos para compilar.

_________________
M740AV + VDR-NG-EM 0.5 - SVN EM 759 - SVN TC - o7o 410 - SVN plugins 744
Disco: Western Digital Elements mediante un NAS
Conectado a Internet
Plugin yaep 0.2.1: http://sites.google.com/site/yaepvdr
avatar
zjuanma
Desarrollador

Cantidad de envíos : 818
Fecha de inscripción : 27/06/2008

Ver perfil de usuario

Volver arriba Ir abajo

Re: Error compilación en linux 64 bits

Mensaje por jb el Lun 14 Sep 2009 - 14:05

zjuanma escribió:cuando te compile, si quereis acelerar la compilacion lanzar el make con -jnumero_de_procesadores, y veras como usa todos los nucleos para compilar.

estoooooooo, únicamente hay que hacer "make -j numero" ó "make -jnumero"???

También vale en la versión de 32 bits?

Salu2
avatar
jb
Betatester

Cantidad de envíos : 1192
Fecha de inscripción : 16/11/2008
Edad : 48
Localización : Lérida y Zaragoza

Ver perfil de usuario

Volver arriba Ir abajo

Re: Error compilación en linux 64 bits

Mensaje por zjuanma el Lun 14 Sep 2009 - 14:30

jb escribió:

estoooooooo, únicamente hay que hacer "make -j numero" ó "make -jnumero"???

También vale en la versión de 32 bits?

Vale siempre que tengas varios nucleos, da igual 32 o 64bits. Y para el make en general.
Me pillas, creo que con espacio, y mira que lo hice el jueves. Me dio un error al generar la clave rsa pero lo vuelves a lanzar y funciona, algun problema de concurrencia.
Fijate en el monitor de CPU como sube a 100% (en mi caso con un core 2 no lo hacia, solo pillaba un nucleo en la compilacion).

_________________
M740AV + VDR-NG-EM 0.5 - SVN EM 759 - SVN TC - o7o 410 - SVN plugins 744
Disco: Western Digital Elements mediante un NAS
Conectado a Internet
Plugin yaep 0.2.1: http://sites.google.com/site/yaepvdr
avatar
zjuanma
Desarrollador

Cantidad de envíos : 818
Fecha de inscripción : 27/06/2008

Ver perfil de usuario

Volver arriba Ir abajo

Re: Error compilación en linux 64 bits

Mensaje por pjllaneras el Lun 14 Sep 2009 - 14:31

zjuanma escribió:cuando te compile, si quereis acelerar la compilacion lanzar el make con -jnumero_de_procesadores, y veras como usa todos los nucleos para compilar.
Bueno es saberlo... ya me fijé que al compilar el ordenador se moría de risa (+-25% de carga)... actualizaré mi script para añadirle esta opción.
avatar
pjllaneras
Betatester

Cantidad de envíos : 569
Fecha de inscripción : 29/01/2009
Edad : 45
Localización : Palma de Mallorca

Ver perfil de usuario

Volver arriba Ir abajo

Re: Error compilación en linux 64 bits

Mensaje por pjllaneras el Sáb 19 Sep 2009 - 12:58

He encontrado la solución!!!

Mientras montaba una máquina virtual con VirtualBox, buscaba la forma de solucionar este problema... probé una par de cosas, hasta que di con una que funcionó.

Se trata de utilizar el programa "linux32". Este programa manipula la salida del comando "uname", haciendo que parezca que estás en una máquina i686:

Código:
~/vdr$ uname -m
x86_64
~/vdr$ linux32 bash
~/vdr$ uname -m
i686

Una vez ejecutado el comando "linux32 bash" (para que luego la compilación funcione bién es necesario el "bash"), se sigue con el proceso normal de compilación... y voila, el proceso termina correctamente:

Código:
...
FW/open7x0.org-m740.wsw \
        -s `date -r /home/pjllaneras/vdr/VDR-NG-EM/VDR-NG-FW/rootfs-squash_m740_andreas-unstable.img +"%s"` \
        -n `date -r /home/pjllaneras/vdr/VDR-NG-EM/VDR-NG-FW/rootfs-squash_m740_andreas-unstable.img +"open7x0.org-m740-%Y-%m-%d-%M%H"`
touch /home/pjllaneras/vdr/VDR-NG-EM/VDR-NG-FW/m7x0_xtc_uclibc_Linux-i686/stagefiles/.post_build
touch /home/pjllaneras/vdr/VDR-NG-EM/VDR-NG-FW/m7x0_xtc_uclibc_Linux-i686/stagefiles/.toolchain-ready

Finished, we are ready to rumble...

Como curiosidad, el proceso en la máquina virtual ha durado 1 hora y media y en "nativo" 1 hora. No he utilizado la opción "j" del make, pero será la próxima prueba, a ver el tiempo que me ahorro, aunque observando todo lo que hace al ejecutar make, me parece que donde se "pierde" más tiempo es descargando ficheros de internet.
avatar
pjllaneras
Betatester

Cantidad de envíos : 569
Fecha de inscripción : 29/01/2009
Edad : 45
Localización : Palma de Mallorca

Ver perfil de usuario

Volver arriba Ir abajo

Re: Error compilación en linux 64 bits

Mensaje por AzagraMac el Vie 25 Mar 2011 - 11:18

una pregunta, anoche estuve compilando.. o mas bien intentándolo. tengo Ubuntu 10.10 64Bits, y probé a compilar asi:
Código:
linux32 make

el error que me reporto fue:
Código:
Too many errors!  Gave up.
make[2]: *** [cpp.info] Error 4
make[2]: se sale del directorio «/home/jose/Desarrollo/TDT/vdr_rev1062/VDR-NG-FW/build/egcs.build/gcc»
make[1]: *** [install-gcc] Error 2
make[1]: se sale del directorio «/home/jose/Desarrollo/TDT/vdr_rev1062/VDR-NG-FW/build/egcs.build»
make: *** [/home/jose/Desarrollo/TDT/vdr_rev1062/VDR-NG-FW/m7x0_xtc_uclibc_Linux-i686/stagefiles/.egcs_installed] Error 2

Antes de "linux32 make" realice los pasos:
Código:
export CC=/usr/bin/gcc-3.4
sudo ln -fs /bin/bash /bin/sh
Y nada.. no hay manera. Llora
avatar
AzagraMac
Betatester

Cantidad de envíos : 121
Fecha de inscripción : 17/01/2010
Edad : 34
Localización : Madrid

Ver perfil de usuario http://azagramac.wordpress.com

Volver arriba Ir abajo

Re: Error compilación en linux 64 bits

Mensaje por sblanco el Vie 25 Mar 2011 - 12:50

¿Has mirado si coincide tu problema con lo que sale en este post?

También se comentó en este post.

Yo no conseguí resolver mi problema, que me parece que era el mismo al tuyo.

Saludos

sblanco

Cantidad de envíos : 84
Fecha de inscripción : 18/07/2008

Ver perfil de usuario

Volver arriba Ir abajo

Re: Error compilación en linux 64 bits

Mensaje por AzagraMac el Vie 25 Mar 2011 - 13:03

cuando llegue a casa pruebo, haber si así compila.. sino, lo que te digo.. a tirar de Ubuntu Server 9.04 32Bits virtual que tengo, y listo.

saludos y gracias
avatar
AzagraMac
Betatester

Cantidad de envíos : 121
Fecha de inscripción : 17/01/2010
Edad : 34
Localización : Madrid

Ver perfil de usuario http://azagramac.wordpress.com

Volver arriba Ir abajo

Re: Error compilación en linux 64 bits

Mensaje por AzagraMac el Vie 25 Mar 2011 - 22:41

Problema nuevo... squashfs image too big! Duda/pregunta

Código:
/home/jose/M750T/VDR-NG-FW/m7x0_xtc_uclibc_Linux-i686/stagefiles/file_tab.rootfs_dir_m740_andreas-unstable.lst
rm -f /home/jose/M750T/VDR-NG-FW/rootfs-squash_m740_andreas-unstable.img
/home/jose/M750T/VDR-NG-FW/m7x0_xtc_uclibc_Linux-i686/bin/mksquashfs /home/jose/M750T/VDR-NG-FW/rootfs_dir_m740_andreas-unstable /home/jose/M750T/VDR-NG-FW/rootfs-squash_m740_andreas-unstable.img \
      -all-root -be -noappend -noI -no-fragments -d /home/jose/M750T/VDR-NG-FW/m7x0_xtc_uclibc_Linux-i686/stagefiles/file_tab.rootfs_dir_m740_andreas-unstable.lst
Duplicate device table entry '/etc' in line  292
Duplicate device table entry '/lib' in line  321
Duplicate device table entry '/lib/modules' in line  349
Duplicate device table entry '/lib/modules/2.4.21-xfs' in line  350
Duplicate device table entry '/etc' in line  400
Duplicate device table entry '/etc' in line  433
Duplicate device table entry '/usr' in line  455
Duplicate device table entry '/usr/sbin' in line  456
Duplicate device table entry '/usr/bin' in line  457
Duplicate device table entry '/sbin' in line  458
Duplicate device table entry '/bin' in line  459
Duplicate device table entry '/etc' in line  460
Duplicate device table entry '/etc/webif' in line  461
Duplicate device table entry '/etc' in line  753
Duplicate device table entry '/etc/vdr' in line  754
Parallel mksquashfs: Using 1 processor
Creating big endian 3.0 filesystem on /home/jose/M750T/VDR-NG-FW/rootfs-squash_m740_andreas-unstable.img, block size 65536.

Big endian filesystem, data block size 65536, compressed data, uncompressed metadata, no fragments
Filesystem size 6306.44 Kbytes (6.16 Mbytes)
   40.99% of uncompressed filesystem size (15386.79 Kbytes)
Inode table size 39096 bytes (38.18 Kbytes)
   100.00% of uncompressed inode table size (39096 bytes)
Directory table size 19633 bytes (19.17 Kbytes)
   100.00% of uncompressed directory table size (19633 bytes)
Number of duplicate files found 1
Number of inodes 1554
Number of files 407
Number of symbolic links  182
Number of device nodes 890
Number of fifo nodes 1
Number of socket nodes 0
Number of directories 74
Number of uids 1
   root (0)
Number of gids 0
squashfs image too big!
make: *** [/home/jose/M750T/VDR-NG-FW/rootfs-squash_m740_andreas-unstable.img] Error 1

2 horas y media de compilacion, para nada Llora Llora Llora Llora Llora Llora Llora Llora Llora Llora
avatar
AzagraMac
Betatester

Cantidad de envíos : 121
Fecha de inscripción : 17/01/2010
Edad : 34
Localización : Madrid

Ver perfil de usuario http://azagramac.wordpress.com

Volver arriba Ir abajo

Re: Error compilación en linux 64 bits

Mensaje por solrac el Sáb 26 Mar 2011 - 15:34

La parte buena es que ya tienes el entorno de compilación preparado. Lo que te ha pasado es que has activado muchas cosas y la imagen que se ha generado es demasiado grande. Desactiva algunas cosas y prueba de nuevo. La próxima compilación te tardará menos tiempo, porque aprovecha lo ya compilado.

Un saludo,
Solrac
avatar
solrac
Betatester

Cantidad de envíos : 552
Fecha de inscripción : 02/07/2008

Ver perfil de usuario

Volver arriba Ir abajo

Re: Error compilación en linux 64 bits

Mensaje por AzagraMac el Sáb 26 Mar 2011 - 17:24

activado muchas cosas Duda/pregunta

mmm creo que solo active la VPN, estoy probando de nuevo, haber si hay mas suerte.

La parte mala esque lo estoy haciendo en la maquina virtual, en mi equipo con Ubuntu 10.10 64Bits, IMPOSIBLE!!! ni con "linux32 make" ni nada... Llora
avatar
AzagraMac
Betatester

Cantidad de envíos : 121
Fecha de inscripción : 17/01/2010
Edad : 34
Localización : Madrid

Ver perfil de usuario http://azagramac.wordpress.com

Volver arriba Ir abajo

Re: Error compilación en linux 64 bits

Mensaje por bittor el Dom 27 Mar 2011 - 17:43

Para que te quepan más cosas en el firmware puedes activar la compresión LZMA del RootFS, es un poco más lento y consume más RAM, pero comprime mucho más los datos.

Para hacerlo, edita el .config para dejarlo así:
Código:
CONFIG_SQUASHFS_LZMA = y
Después para forzar que se recompile bien, ejecuta:
Código:
make distclean-squashfs-host distclean-siemens-linux-kernel
make
avatar
bittor
Desarrollador

Cantidad de envíos : 3633
Fecha de inscripción : 25/06/2008
Localización : Zaragoza

Ver perfil de usuario http://bittor7x0.googlepages.com

Volver arriba Ir abajo

Re: Error compilación en linux 64 bits

Mensaje por AzagraMac el Dom 27 Mar 2011 - 17:58

Gracias Bittor, ahora mismo estaba liado con la configuración previa, asi me lo ahorro después de instalarlo.

Me va ha venir genial. saludos
avatar
AzagraMac
Betatester

Cantidad de envíos : 121
Fecha de inscripción : 17/01/2010
Edad : 34
Localización : Madrid

Ver perfil de usuario http://azagramac.wordpress.com

Volver arriba Ir abajo

Re: Error compilación en linux 64 bits

Mensaje por omismo el Jue 23 Jun 2011 - 17:54

Buenas,estoy dandole vueltas y no logro compilar.Ubuntu 11.04 64 bits;me sale el siguiente error,despues de otros mas que an ido saliendo a lo largo de la compilacion y e ido solucionando gracias a algunos consejos o anotaciones de este foro.

Lo curioso es que probe con Linux mint 64,tambien la ultima version y me da el mismo error;ejecute como vi en alguna reseña de Bittor "linux32",y da igual,siempre el mismo error,tanto en 64 como en 32.
Código:

make[1]: se sale del directorio «/home/rafa/VDR-NG-EM/VDR-NG-FW/build/e2fsprogs.build»
touch /home/rafa/VDR-NG-EM/VDR-NG-FW/m7x0_xtc_uclibc_Linux-x86_64/stagefiles/.e2fsprogs_installed
rm -rf /home/rafa/VDR-NG-EM/VDR-NG-FW/build/egcs-1.1.2
bzcat /home/rafa/VDR-NG-EM/VDR-NG-FW/downloads/egcs-1.1.2.tar.bz2 | tar -x -C /home/rafa/VDR-NG-EM/VDR-NG-FW/build -f -
tar: Un bloque de ceros aislado en 102560
touch /home/rafa/VDR-NG-EM/VDR-NG-FW/m7x0_xtc_uclibc_Linux-x86_64/stagefiles/.egcs_unpacked
for patch_file in `find  /home/rafa/VDR-NG-EM/VDR-NG-FW/patches/egcs/1.1.2/common -type f -iname '*.patch' | sort` ; do patch -p1 -E -d  /home/rafa/VDR-NG-EM/VDR-NG-FW/build/egcs-1.1.2 < $patch_file ; done
patching file configure.in
patching file gcc/config/mips/linux64.h
patching file gcc/config/mips/linux.h
patching file gcc/config/mips/llinux64.h
patching file gcc/config/mips/llinux.h
patching file gcc/config/mips/mips.md
patching file gcc/config/mips/t-linux
patching file gcc/config/mips/t-linux64
patching file gcc/config/mips/xm-linux.h
patching file gcc/configure
patching file gcc/configure.in
for patch_file in `find  /home/rafa/VDR-NG-EM/VDR-NG-FW/patches/egcs/1.1.2/host/Linux -type f -iname '*.patch' | sort` ; do patch -p1 -E -d  /home/rafa/VDR-NG-EM/VDR-NG-FW/build/egcs-1.1.2 < $patch_file ; done
touch /home/rafa/VDR-NG-EM/VDR-NG-FW/m7x0_xtc_uclibc_Linux-x86_64/stagefiles/.egcs_patched
ln -sfn /home/rafa/VDR-NG-EM/VDR-NG-FW/m7x0_xtc_uclibc_Linux-x86_64/mips-linux-uclibc /home/rafa/VDR-NG-EM/VDR-NG-FW/m7x0_xtc_uclibc_Linux-x86_64/mips-linux
rm -rf /home/rafa/VDR-NG-EM/VDR-NG-FW/build/egcs.build
mkdir -p /home/rafa/VDR-NG-EM/VDR-NG-FW/build/egcs.build
(cd /home/rafa/VDR-NG-EM/VDR-NG-FW/build/egcs.build ; PATH='/home/rafa/VDR-NG-EM/VDR-NG-FW/m7x0_xtc_uclibc_Linux-x86_64/bin:/usr/local/sbin:/usr/local/bin:/usr/sbin:/usr/bin:/sbin:/bin:/usr/X11R6/bin' CC=/usr/bin/gcc-3.4 \
      /home/rafa/VDR-NG-EM/VDR-NG-FW/build/egcs-1.1.2/configure \
         --prefix=/home/rafa/VDR-NG-EM/VDR-NG-FW/m7x0_xtc_uclibc_Linux-x86_64 \
         --host=i686-linux-gnu \
         --target=mips-linux \
         --program-prefix=mips-linux-uclibc- \
         --with-gnu-as \
         --with-gnu-ld \
         --disable-nls \
         --nfp \
         --enable-languages="c" \
         --with-headers=/home/rafa/VDR-NG-EM/VDR-NG-FW/m7x0_xtc_uclibc_Linux-x86_64/target_root/usr/include)
Created "Makefile" in /home/rafa/VDR-NG-EM/VDR-NG-FW/build/egcs.build using "mt-frag"
/usr/bin/ld: cannot find -lgcc_s
collect2: ld devolvió el estado de salida 1
*** The command '/usr/bin/gcc-3.4 -o conftest -g  conftest.c' failed.
*** You must set the environment variable CC to a working compiler.
make: *** [/home/rafa/VDR-NG-EM/VDR-NG-FW/m7x0_xtc_uclibc_Linux-x86_64/stagefiles/.egcs_configured] Error 1

Quedo a la espera de alguna respuesta,agradeciendo vuestro interes.
avatar
omismo

Cantidad de envíos : 100
Fecha de inscripción : 22/06/2009

Ver perfil de usuario

Volver arriba Ir abajo

Re: Error compilación en linux 64 bits

Mensaje por bittor el Jue 23 Jun 2011 - 20:13

Comprueba que tienes bien instalado el gcc 3.4 con
Código:
/usr/bin/gcc-3.4 --version

También puedes probar la versión trunk que no requiere el gcc 3.4.
avatar
bittor
Desarrollador

Cantidad de envíos : 3633
Fecha de inscripción : 25/06/2008
Localización : Zaragoza

Ver perfil de usuario http://bittor7x0.googlepages.com

Volver arriba Ir abajo

Re: Error compilación en linux 64 bits

Mensaje por omismo el Vie 24 Jun 2011 - 18:49

si,por lo visto si esta bien instalado ya que no me da respuesta de ningun fallo.
Código:

rafa@rafa-OptiPlex-755:~$ /usr/bin/gcc-3.4 --version
gcc-3.4 (GCC) 3.4.6 (Debian 3.4.6-9)
Copyright (C) 2006 Free Software Foundation, Inc.
Esto es software libre; vea el código para las condiciones de copia.  NO hay
garantía; ni siquiera para MERCANTIBILIDAD o IDONEIDAD PARA UN PROPÓSITO EN
PARTICULAR
Y en la trunk me pasa algo parecido ahi van las lineas del log donde se refleja el error,que algo tiene que ver con el GCC
tambien.E instalado y desinstalado varias veces este compilador en diferentes versiones,comenzando desde 0,y no hay tu tia.
Código:

rm -f /home/rafa/vdr-ng-em/m7x0_xtc_uclibc_Linux-i686/man/man1/`t='s,x,x,'; echo gcc | sed -e $t`.1; \
     /bin/sh /home/rafa/vdr-ng-em/build/egcs-1.1.2/install-sh -c -m 644 /home/rafa/vdr-ng-em/build/egcs-1.1.2/gcc/gcc.1 /home/rafa/vdr-ng-em/m7x0_xtc_uclibc_Linux-i686/man/man1/`t='s,x,x,'; echo gcc | sed -e $t`.1; \
     chmod a-x /home/rafa/vdr-ng-em/m7x0_xtc_uclibc_Linux-i686/man/man1/`t='s,x,x,'; echo gcc | sed -e $t`.1; \
   fi
rm -f /home/rafa/vdr-ng-em/m7x0_xtc_uclibc_Linux-i686/man/man1/cccp.1
/bin/sh /home/rafa/vdr-ng-em/build/egcs-1.1.2/install-sh -c -m 644 /home/rafa/vdr-ng-em/build/egcs-1.1.2/gcc/cccp.1 /home/rafa/vdr-ng-em/m7x0_xtc_uclibc_Linux-i686/man/man1/cccp.1
chmod a-x /home/rafa/vdr-ng-em/m7x0_xtc_uclibc_Linux-i686/man/man1/cccp.1
/home/rafa/vdr-ng-em/build/egcs.build/texinfo/makeinfo/makeinfo  -I/home/rafa/vdr-ng-em/build/egcs-1.1.2/gcc -o cpp.info /home/rafa/vdr-ng-em/build/egcs-1.1.2/gcc/cpp.texi
Making info file `cpp.info' from `/home/rafa/vdr-ng-em/build/egcs-1.1.2/gcc/cpp.texi'.
/home/rafa/vdr-ng-em/build/egcs-1.1.2/gcc/cpp.texi:10: Bad argument to `end', `direnryy', using `direntry'.
/home/rafa/vdr-ng-em/build/egcs-1.1.2/gcc/cpp.texi:134: Bad argument to `end', `mnuu', using `menu'.
/home/rafa/vdr-ng-em/build/egcs-1.1.2/gcc/cpp.texi:264: Bad argument to `end', `mnuu', using `menu'.
/home/rafa/vdr-ng-em/build/egcs-1.1.2/gcc/cpp.texi:308: Unknown command `cdde'.
/home/rafa/vdr-ng-em/build/egcs-1.1.2/gcc/cpp.texi:308: Misplaced {.
/home/rafa/vdr-ng-em/build/egcs-1.1.2/gcc/cpp.texi:308: Misplaced }.
/home/rafa/vdr-ng-em/build/egcs-1.1.2/gcc/cpp.texi:328: Unknown command `cdde'.
/home/rafa/vdr-ng-em/build/egcs-1.1.2/gcc/cpp.texi:328: Misplaced {.
/home/rafa/vdr-ng-em/build/egcs-1.1.2/gcc/cpp.texi:328: Misplaced }.
/home/rafa/vdr-ng-em/build/egcs-1.1.2/gcc/cpp.texi:345: Unknown command `cdde'.
/home/rafa/vdr-ng-em/build/egcs-1.1.2/gcc/cpp.texi:345: Misplaced {.
/home/rafa/vdr-ng-em/build/egcs-1.1.2/gcc/cpp.texi:345: Misplaced }.
/home/rafa/vdr-ng-em/build/egcs-1.1.2/gcc/cpp.texi:360: Bad argument to `end', `talle', using `table'.
/home/rafa/vdr-ng-em/build/egcs-1.1.2/gcc/cpp.texi:553: Bad argument to `end', `mnuu', using `menu'.
/home/rafa/vdr-ng-em/build/egcs-1.1.2/gcc/cpp.texi:814: Bad argument to `end', `mnuu', using `menu'.
/home/rafa/vdr-ng-em/build/egcs-1.1.2/gcc/cpp.texi:827: Unknown command `cdde'.
/home/rafa/vdr-ng-em/build/egcs-1.1.2/gcc/cpp.texi:827: Misplaced {.
/home/rafa/vdr-ng-em/build/egcs-1.1.2/gcc/cpp.texi:827: Misplaced }.
/home/rafa/vdr-ng-em/build/egcs-1.1.2/gcc/cpp.texi:833: Unknown command `cdde'.
/home/rafa/vdr-ng-em/build/egcs-1.1.2/gcc/cpp.texi:833: Misplaced {.
/home/rafa/vdr-ng-em/build/egcs-1.1.2/gcc/cpp.texi:833: Misplaced }.
/home/rafa/vdr-ng-em/build/egcs-1.1.2/gcc/cpp.texi:849: Bad argument to `end', `smallxaample', using `smallexample'.
/home/rafa/vdr-ng-em/build/egcs-1.1.2/gcc/cpp.texi:862: Unknown command `cdde'.
/home/rafa/vdr-ng-em/build/egcs-1.1.2/gcc/cpp.texi:862: Misplaced {.
/home/rafa/vdr-ng-em/build/egcs-1.1.2/gcc/cpp.texi:862: Misplaced }.
/home/rafa/vdr-ng-em/build/egcs-1.1.2/gcc/cpp.texi:870: Unknown command `cdde'.
/home/rafa/vdr-ng-em/build/egcs-1.1.2/gcc/cpp.texi:870: Misplaced {.
/home/rafa/vdr-ng-em/build/egcs-1.1.2/gcc/cpp.texi:870: Misplaced }.
/home/rafa/vdr-ng-em/build/egcs-1.1.2/gcc/cpp.texi:876: Unknown command `cdde'.
/home/rafa/vdr-ng-em/build/egcs-1.1.2/gcc/cpp.texi:876: Misplaced {.
/home/rafa/vdr-ng-em/build/egcs-1.1.2/gcc/cpp.texi:876: Misplaced }.
/home/rafa/vdr-ng-em/build/egcs-1.1.2/gcc/cpp.texi:890: Unknown command `cdde'.
/home/rafa/vdr-ng-em/build/egcs-1.1.2/gcc/cpp.texi:890: Misplaced {.
/home/rafa/vdr-ng-em/build/egcs-1.1.2/gcc/cpp.texi:890: Misplaced }.
/home/rafa/vdr-ng-em/build/egcs-1.1.2/gcc/cpp.texi:902: Unknown command `cdde'.
/home/rafa/vdr-ng-em/build/egcs-1.1.2/gcc/cpp.texi:902: Misplaced {.
/home/rafa/vdr-ng-em/build/egcs-1.1.2/gcc/cpp.texi:902: Misplaced }.
/home/rafa/vdr-ng-em/build/egcs-1.1.2/gcc/cpp.texi:910: Unknown command `cdde'.
/home/rafa/vdr-ng-em/build/egcs-1.1.2/gcc/cpp.texi:910: Misplaced {.
/home/rafa/vdr-ng-em/build/egcs-1.1.2/gcc/cpp.texi:910: Misplaced }.
/home/rafa/vdr-ng-em/build/egcs-1.1.2/gcc/cpp.texi:920: Unknown command `cdde'.
/home/rafa/vdr-ng-em/build/egcs-1.1.2/gcc/cpp.texi:920: Misplaced {.
/home/rafa/vdr-ng-em/build/egcs-1.1.2/gcc/cpp.texi:920: Misplaced }.
/home/rafa/vdr-ng-em/build/egcs-1.1.2/gcc/cpp.texi:926: Unknown command `cdde'.
/home/rafa/vdr-ng-em/build/egcs-1.1.2/gcc/cpp.texi:926: Misplaced {.
/home/rafa/vdr-ng-em/build/egcs-1.1.2/gcc/cpp.texi:926: Misplaced }.
/home/rafa/vdr-ng-em/build/egcs-1.1.2/gcc/cpp.texi:933: Unknown command `cdde'.
/home/rafa/vdr-ng-em/build/egcs-1.1.2/gcc/cpp.texi:933: Misplaced {.
/home/rafa/vdr-ng-em/build/egcs-1.1.2/gcc/cpp.texi:933: Misplaced }.
/home/rafa/vdr-ng-em/build/egcs-1.1.2/gcc/cpp.texi:941: Unknown command `cdde'.
/home/rafa/vdr-ng-em/build/egcs-1.1.2/gcc/cpp.texi:941: Misplaced {.
/home/rafa/vdr-ng-em/build/egcs-1.1.2/gcc/cpp.texi:941: Misplaced }.
/home/rafa/vdr-ng-em/build/egcs-1.1.2/gcc/cpp.texi:947: Unknown command `cdde'.
/home/rafa/vdr-ng-em/build/egcs-1.1.2/gcc/cpp.texi:947: Misplaced {.
/home/rafa/vdr-ng-em/build/egcs-1.1.2/gcc/cpp.texi:947: Misplaced }.
/home/rafa/vdr-ng-em/build/egcs-1.1.2/gcc/cpp.texi:955: Unknown command `cdde'.
/home/rafa/vdr-ng-em/build/egcs-1.1.2/gcc/cpp.texi:955: Misplaced {.
/home/rafa/vdr-ng-em/build/egcs-1.1.2/gcc/cpp.texi:955: Misplaced }.
/home/rafa/vdr-ng-em/build/egcs-1.1.2/gcc/cpp.texi:961: Unknown command `cdde'.
/home/rafa/vdr-ng-em/build/egcs-1.1.2/gcc/cpp.texi:961: Misplaced {.
/home/rafa/vdr-ng-em/build/egcs-1.1.2/gcc/cpp.texi:961: Misplaced }.
/home/rafa/vdr-ng-em/build/egcs-1.1.2/gcc/cpp.texi:969: Unknown command `cdde'.
/home/rafa/vdr-ng-em/build/egcs-1.1.2/gcc/cpp.texi:969: Misplaced {.
/home/rafa/vdr-ng-em/build/egcs-1.1.2/gcc/cpp.texi:969: Misplaced }.
/home/rafa/vdr-ng-em/build/egcs-1.1.2/gcc/cpp.texi:979: Unknown command `cdde'.
/home/rafa/vdr-ng-em/build/egcs-1.1.2/gcc/cpp.texi:979: Misplaced {.
/home/rafa/vdr-ng-em/build/egcs-1.1.2/gcc/cpp.texi:979: Misplaced }.
/home/rafa/vdr-ng-em/build/egcs-1.1.2/gcc/cpp.texi:988: Unknown command `cdde'.
/home/rafa/vdr-ng-em/build/egcs-1.1.2/gcc/cpp.texi:988: Misplaced {.
/home/rafa/vdr-ng-em/build/egcs-1.1.2/gcc/cpp.texi:988: Misplaced }.
/home/rafa/vdr-ng-em/build/egcs-1.1.2/gcc/cpp.texi:997: Bad argument to `end', `talle', using `table'.
/home/rafa/vdr-ng-em/build/egcs-1.1.2/gcc/cpp.texi:1013: Unknown command `cdde'.
/home/rafa/vdr-ng-em/build/egcs-1.1.2/gcc/cpp.texi:1013: Misplaced {.
/home/rafa/vdr-ng-em/build/egcs-1.1.2/gcc/cpp.texi:1013: Misplaced }.
/home/rafa/vdr-ng-em/build/egcs-1.1.2/gcc/cpp.texi:1017: Unknown command `cdde'.
/home/rafa/vdr-ng-em/build/egcs-1.1.2/gcc/cpp.texi:1017: Misplaced {.
/home/rafa/vdr-ng-em/build/egcs-1.1.2/gcc/cpp.texi:1017: Misplaced }.
/home/rafa/vdr-ng-em/build/egcs-1.1.2/gcc/cpp.texi:1021: Bad argument to `end', `talle', using `table'.
/home/rafa/vdr-ng-em/build/egcs-1.1.2/gcc/cpp.texi:1027: Unknown command `cdde'.
/home/rafa/vdr-ng-em/build/egcs-1.1.2/gcc/cpp.texi:1027: Misplaced {.
/home/rafa/vdr-ng-em/build/egcs-1.1.2/gcc/cpp.texi:1027: Misplaced }.
/home/rafa/vdr-ng-em/build/egcs-1.1.2/gcc/cpp.texi:1031: Unknown command `cdde'.
/home/rafa/vdr-ng-em/build/egcs-1.1.2/gcc/cpp.texi:1031: Misplaced {.
/home/rafa/vdr-ng-em/build/egcs-1.1.2/gcc/cpp.texi:1031: Misplaced }.
/home/rafa/vdr-ng-em/build/egcs-1.1.2/gcc/cpp.texi:1036: Unknown command `cdde'.
/home/rafa/vdr-ng-em/build/egcs-1.1.2/gcc/cpp.texi:1036: Misplaced {.
/home/rafa/vdr-ng-em/build/egcs-1.1.2/gcc/cpp.texi:1036: Misplaced }.
/home/rafa/vdr-ng-em/build/egcs-1.1.2/gcc/cpp.texi:1043: Unknown command `cdde'.
/home/rafa/vdr-ng-em/build/egcs-1.1.2/gcc/cpp.texi:1043: Misplaced {.
/home/rafa/vdr-ng-em/build/egcs-1.1.2/gcc/cpp.texi:1043: Misplaced }.
/home/rafa/vdr-ng-em/build/egcs-1.1.2/gcc/cpp.texi:1049: Unknown command `cdde'.
/home/rafa/vdr-ng-em/build/egcs-1.1.2/gcc/cpp.texi:1049: Misplaced {.
/home/rafa/vdr-ng-em/build/egcs-1.1.2/gcc/cpp.texi:1049: Misplaced }.
/home/rafa/vdr-ng-em/build/egcs-1.1.2/gcc/cpp.texi:1051: Unknown command `cdde'.
/home/rafa/vdr-ng-em/build/egcs-1.1.2/gcc/cpp.texi:1051: Misplaced {.
/home/rafa/vdr-ng-em/build/egcs-1.1.2/gcc/cpp.texi:1051: Misplaced }.
/home/rafa/vdr-ng-em/build/egcs-1.1.2/gcc/cpp.texi:1056: Unknown command `cdde'.
/home/rafa/vdr-ng-em/build/egcs-1.1.2/gcc/cpp.texi:1056: Misplaced {.
/home/rafa/vdr-ng-em/build/egcs-1.1.2/gcc/cpp.texi:1056: Misplaced }.
/home/rafa/vdr-ng-em/build/egcs-1.1.2/gcc/cpp.texi:1060: Bad argument to `end', `talle', using `table'.
Too many errors!  Gave up.
make[2]: *** [cpp.info] Error 4
make[2]: se sale del directorio «/home/rafa/vdr-ng-em/build/egcs.build/gcc»
make[1]: *** [install-gcc] Error 2
make[1]: se sale del directorio «/home/rafa/vdr-ng-em/build/egcs.build»
make: *** [/home/rafa/vdr-ng-em/m7x0_xtc_uclibc_Linux-i686/stagefiles/.egcs_installed] Error 2
rafa@rafa-OptiPlex-755:~/vdr-ng-em$
avatar
omismo

Cantidad de envíos : 100
Fecha de inscripción : 22/06/2009

Ver perfil de usuario

Volver arriba Ir abajo

Re: Error compilación en linux 64 bits

Mensaje por Videre el Vie 24 Jun 2011 - 21:40

En el trunk creo que te falta instalar el paquete textinfo.

_________________
Firmware VDR-NG-EM 0.7 Pro
Última revisión del SVN
avatar
Videre
Desarrollador

Cantidad de envíos : 391
Fecha de inscripción : 27/09/2008

Ver perfil de usuario

Volver arriba Ir abajo

Re: Error compilación en linux 64 bits

Mensaje por omismo el Sáb 25 Jun 2011 - 16:14

E desistido,al final con virtualbox,monte una iso de ubuntu 10.10 32 bits,y esta corriendo correctamente la compilacion sin problemas,continuando despues del "mt-frag" y de la compilacion con gcc-3.4
Código:

Created "Makefile" in /home/rafa/VDR-NG-EM/VDR-NG-FW/build/egcs.build using "mt-frag"
/usr/bin/ld: cannot find -lgcc_s
collect2: ld devolvió el estado de salida 1
*** The command '/usr/bin/gcc-3.4 -o conftest -g  conftest.c' failed.
*** You must set the environment variable CC to a working compiler.
make: *** [/home/rafa/VDR-NG-EM/VDR-NG-FW/m7x0_xtc_uclibc_Linux-x86_64/stagefiles/.egcs_configured] Error 1
.......dejare esta imagen de VBox para las compilaciones...ya que por lo que sea las actualizaciones a las ultimas versiones van dejando a un lado las compatibilidades con lo mas viejo...
avatar
omismo

Cantidad de envíos : 100
Fecha de inscripción : 22/06/2009

Ver perfil de usuario

Volver arriba Ir abajo

Re: Error compilación en linux 64 bits

Mensaje por Contenido patrocinado


Contenido patrocinado


Volver arriba Ir abajo

Ver el tema anterior Ver el tema siguiente Volver arriba


 
Permisos de este foro:
No puedes responder a temas en este foro.