Buscar
 
 

Resultados por:
 


Rechercher Búsqueda avanzada

Navegación
 Índice
 Wiki
 FAQ del foro
 FAQ del VDR-NG-EM
 Funcionalidades del VDR
 Mejoras del VDR-NG-EM
 Primeros pasos FW-VDR
 Descargas VDR-NG-EM
Flujo RSS


Yahoo! 
MSN 
AOL 
Netvibes 
Bloglines 



Problemas con la compilacion

Página 4 de 5. Precedente  1, 2, 3, 4, 5  Siguiente

Ver el tema anterior Ver el tema siguiente Ir abajo

Re: Problemas con la compilacion

Mensaje por caparrut el Dom 7 Feb 2010 - 21:38

--2010-02-07 21:20:29-- (intento:18) http://dfn.dl.sourceforge.net/sourceforge/cramfs/cramfs-1.1.tar.gz
Conectando a dfn.dl.sourceforge.net|194.95.236.6|:80... falló: Expiró el tiempo de conexión.
Reintentando.

--2010-02-07 21:23:48-- (intento:19) http://dfn.dl.sourceforge.net/sourceforge/cramfs/cramfs-1.1.tar.gz
Conectando a dfn.dl.sourceforge.net|194.95.236.6|:80... falló: Expiró el tiempo de conexión.
Reintentando.

--2010-02-07 21:27:07-- (intento:20) http://dfn.dl.sourceforge.net/sourceforge/cramfs/cramfs-1.1.tar.gz
Conectando a dfn.dl.sourceforge.net|194.95.236.6|:80... falló: Expiró el tiempo de conexión.
Dándose por vencido.

make: *** [/home/yo/VDR-NG-EM/VDR-NG-FW/downloads/cramfs-1.1.tar.gz] Error 1
yo@123456789:~/VDR-NG-EM/VDR-NG-FW$


ay muchos mas no por nada por saverlo
avatar
caparrut

Cantidad de envíos : 294
Fecha de inscripción : 14/11/2008
Localización : Muro de alcoy

Ver perfil de usuario

Volver arriba Ir abajo

Re: Problemas con la compilacion

Mensaje por pjllaneras el Dom 7 Feb 2010 - 22:08

Hola caparrut,

En mi mensaje anterior te he comentado lo que debes hacer para solucionar este problema... realmente es el mismo problema que en los otros, deberás descargar el archivo manualmente y ponerlo en la carpeta "downloads".
avatar
pjllaneras
Betatester

Cantidad de envíos : 569
Fecha de inscripción : 29/01/2009
Edad : 44
Localización : Palma de Mallorca

Ver perfil de usuario

Volver arriba Ir abajo

Re: Problemas con la compilacion

Mensaje por caparrut el Mar 9 Feb 2010 - 10:32

Now you can edit config files in "./VDR-NG-FW" and later run "make"

yo@123456789:~/VDR-NG-EM$ VDR-NG-EM/VDR-NG-FW/.config
bash: VDR-NG-EM/VDR-NG-FW/.config: No existe el fichero ó directorio
yo@123456789:~/VDR-NG-EM$ cd VDR-NG-FW
yo@123456789:~/VDR-NG-EM/VDR-NG-FW$ export PATH=$PATH:./; make

esto es asi bavien
avatar
caparrut

Cantidad de envíos : 294
Fecha de inscripción : 14/11/2008
Localización : Muro de alcoy

Ver perfil de usuario

Volver arriba Ir abajo

Re: Problemas con la compilacion

Mensaje por caparrut el Mar 9 Feb 2010 - 11:25

--2010-02-09 11:11:41-- (intento: 2) http://dfn.dl.sourceforge.net/sourceforge/e2fsprogs/e2fsprogs-1.41.8.tar.gz
Conectando a dfn.dl.sourceforge.net|194.95.236.6|:80... falló: Expiró el tiempo de conexión.
Reintentando.

--2010-02-09 11:14:52-- (intento: 3) http://dfn.dl.sourceforge.net/sourceforge/e2fsprogs/e2fsprogs-1.41.8.tar.gz
Conectando a dfn.dl.sourceforge.net|194.95.236.6|:80...

me he bajado los archivos directos buscando el google, he quitado los que abia y epuesto los nuevos, pero es normal lo que me pone en el mensaje de antes,
y que el terminal no se conecta o tengo que acer mas cosa para que baya,gracias por vuestra ayuda
avatar
caparrut

Cantidad de envíos : 294
Fecha de inscripción : 14/11/2008
Localización : Muro de alcoy

Ver perfil de usuario

Volver arriba Ir abajo

Re: Problemas con la compilacion

Mensaje por pjllaneras el Mar 9 Feb 2010 - 11:26

caparrut escribió:yo@123456789:~/VDR-NG-EM$ VDR-NG-EM/VDR-NG-FW/.config
El archivo .config no se ejecuta, si quieres (no es obligado hacerlo) puedes editarlo (por ejemplo, desde la consola poner gedit .config) para cambiar opciones de compilación, pero no hace falta que lo hagas (es opcional).

El resto parece correcto... espero que ahora termine bién y puedas tener el nuevo firmware.
avatar
pjllaneras
Betatester

Cantidad de envíos : 569
Fecha de inscripción : 29/01/2009
Edad : 44
Localización : Palma de Mallorca

Ver perfil de usuario

Volver arriba Ir abajo

Re: Problemas con la compilacion

Mensaje por pjllaneras el Mar 9 Feb 2010 - 11:30

caparrut escribió:--2010-02-09 11:11:41-- (intento: 2) http://dfn.dl.sourceforge.net/sourceforge/e2fsprogs/e2fsprogs-1.41.8.tar.gz
Conectando a dfn.dl.sourceforge.net|194.95.236.6|:80... falló: Expiró el tiempo de conexión.
Reintentando.

--2010-02-09 11:14:52-- (intento: 3) http://dfn.dl.sourceforge.net/sourceforge/e2fsprogs/e2fsprogs-1.41.8.tar.gz
Conectando a dfn.dl.sourceforge.net|194.95.236.6|:80...

me he bajado los archivos directos buscando el google, he quitado los que abia y epuesto los nuevos, pero es normal lo que me pone en el mensaje de antes,
y que el terminal no se conecta o tengo que acer mas cosa para que baya,gracias por vuestra ayuda
¿Seguro que has bajado los archivos y puestos en la carpeta "VDR-NG-EM/VDR-NG-FW/downloads" tal como te indiqué?

Ten en cuenta que los archivos deben ser exactamente los que se intenta descargar (versión y extensión), sino no funcionará y los intentará descargar de nuevo.
avatar
pjllaneras
Betatester

Cantidad de envíos : 569
Fecha de inscripción : 29/01/2009
Edad : 44
Localización : Palma de Mallorca

Ver perfil de usuario

Volver arriba Ir abajo

Re: Problemas con la compilacion

Mensaje por caparrut el Mar 9 Feb 2010 - 12:03

si, mira aver si me falta alguno o estan mal o sobra y medices algo gracias de nuevo

binutils-2.19.1.tar.bz2
busybox-1.14.3.tar.tar
cramfs-1.1.tar.gz
dosfstools-2.11.src.tar.gz
dropbear-0.52.tar.bz2
e2fsprogs-1.41.9.tar.gz
egcs-1.1.2.tar.bz2
fw-siemens-m740-2.4.zip
gcc-core-4.4.1.tar.bz2
gcc-g++-4.4.1.tar.bz2
lirc-0.8.6.tar.bz2
m7x0-linux-headers.tar.bz2
rsacoder.tar.bz2
uClibc-0.9.30-rc1.tar.tar
avatar
caparrut

Cantidad de envíos : 294
Fecha de inscripción : 14/11/2008
Localización : Muro de alcoy

Ver perfil de usuario

Volver arriba Ir abajo

Re: Problemas con la compilacion

Mensaje por pjllaneras el Mar 9 Feb 2010 - 12:23

caparrut escribió:si, mira aver si me falta alguno o estan mal o sobra y medices algo gracias de nuevo

binutils-2.19.1.tar.bz2
busybox-1.14.3.tar.tar
cramfs-1.1.tar.gz
dosfstools-2.11.src.tar.gz
dropbear-0.52.tar.bz2
e2fsprogs-1.41.9.tar.gz
egcs-1.1.2.tar.bz2
fw-siemens-m740-2.4.zip
gcc-core-4.4.1.tar.bz2
gcc-g++-4.4.1.tar.bz2
lirc-0.8.6.tar.bz2
m7x0-linux-headers.tar.bz2
rsacoder.tar.bz2
uClibc-0.9.30-rc1.tar.tar
No estoy en casa y no puedo confirmarte fichero a fichero... pero el e2fsprogs-1.41.9.tar.gz está mal ya que debería ser e2fsprogs-1.41.8.tar.gz. Debes bajarte la versión exacta que indica el programa, sino no funcionará.
avatar
pjllaneras
Betatester

Cantidad de envíos : 569
Fecha de inscripción : 29/01/2009
Edad : 44
Localización : Palma de Mallorca

Ver perfil de usuario

Volver arriba Ir abajo

Re: Problemas con la compilacion

Mensaje por caparrut el Miér 10 Feb 2010 - 11:02

hola pjllaneras estado leyendo las paginas 2,3,4,deste mismo foro y todo lo que pone de los archivos que hay que meter cada uno en su sitio hay que hacerlo tambien porque las direcciones que dicen no las encuentro como:
Aquí dejo el VDR-M7x0 con todos nuestros parches actualizados, los plugins del open7x0 y el bootmenu:
vdr-m7x0-ng-em.tar.bz2
vdr-m7x0-PLUGINS.tar.bz2
bootmenu.tar.bz2

Aquí está el VDR-NG-FW.orig

Cuando intente conectarse para bajarse el VDR o los plugins dará un error y no continuará.
Fijaros en el nombre del archivo que da error dentro de stagefiles y crearlo manualmente así:

Código:
touch m7x0_xtc_uclibc_Linux-i686/stagefiles/.vdr_downloaded

Volvéis a ejecutar el make y a repetir el proceso las veces que sea necesario o que alguien modifique los scripts para que no se conecte y los publique.

porque donde esta la carpeta sies una carpeta (dentro de stagefiles ) a ver si me aclaras un poco esto muchas gracias
avatar
caparrut

Cantidad de envíos : 294
Fecha de inscripción : 14/11/2008
Localización : Muro de alcoy

Ver perfil de usuario

Volver arriba Ir abajo

Re: Problemas con la compilacion

Mensaje por bittor el Miér 10 Feb 2010 - 16:19

Olvídate de eso porque era para resolver otro problema que ya no pasa.

Cuando te falle la descarga de un programa, buscas el nombre exacto en google y te lo bajas a downloads.
Vuelves a ejecutar el make y así hasta que termine.
avatar
bittor
Desarrollador

Cantidad de envíos : 3629
Fecha de inscripción : 25/06/2008
Localización : Zaragoza

Ver perfil de usuario http://bittor7x0.googlepages.com

Volver arriba Ir abajo

Re: Problemas con la compilacion

Mensaje por zjuanma el Miér 10 Feb 2010 - 22:21

He subido un par de parches para 2 ficheros que fallaba al descargar. Ya deberian de descargarse correctamente

_________________
M740AV + VDR-NG-EM 0.5 - SVN EM 759 - SVN TC - o7o 410 - SVN plugins 744
Disco: Western Digital Elements mediante un NAS
Conectado a Internet
Plugin yaep 0.2.1: http://sites.google.com/site/yaepvdr
avatar
zjuanma
Desarrollador

Cantidad de envíos : 818
Fecha de inscripción : 27/06/2008

Ver perfil de usuario

Volver arriba Ir abajo

Re: Problemas con la compilacion

Mensaje por caparrut el Miér 10 Feb 2010 - 23:38

gracias voy a probar ya oscuento
avatar
caparrut

Cantidad de envíos : 294
Fecha de inscripción : 14/11/2008
Localización : Muro de alcoy

Ver perfil de usuario

Volver arriba Ir abajo

Re: Problemas con la compilacion

Mensaje por caparrut el Miér 10 Feb 2010 - 23:45

una pregunta si un fichero falla cuando lo ponga en downloads tengo que hacer todo el proceso de nuevo o no gracias
avatar
caparrut

Cantidad de envíos : 294
Fecha de inscripción : 14/11/2008
Localización : Muro de alcoy

Ver perfil de usuario

Volver arriba Ir abajo

Re: Problemas con la compilacion

Mensaje por zjuanma el Jue 11 Feb 2010 - 0:00

no solo el ejecuta el make y continuara por donde se quedo.

_________________
M740AV + VDR-NG-EM 0.5 - SVN EM 759 - SVN TC - o7o 410 - SVN plugins 744
Disco: Western Digital Elements mediante un NAS
Conectado a Internet
Plugin yaep 0.2.1: http://sites.google.com/site/yaepvdr
avatar
zjuanma
Desarrollador

Cantidad de envíos : 818
Fecha de inscripción : 27/06/2008

Ver perfil de usuario

Volver arriba Ir abajo

Re: Problemas con la compilacion

Mensaje por caparrut el Jue 11 Feb 2010 - 8:36

aver si lo hago como pone en la wiki es para 740 o no
avatar
caparrut

Cantidad de envíos : 294
Fecha de inscripción : 14/11/2008
Localización : Muro de alcoy

Ver perfil de usuario

Volver arriba Ir abajo

Re: Problemas con la compilacion

Mensaje por pjllaneras el Jue 11 Feb 2010 - 9:07

caparrut escribió:aver si lo hago como pone en la wiki es para 740 o no
Lo que dice en la wiki es válido para el 740 y el 750, lo único que cambia es un fichero de configuración, el resto es exactamente lo mismo.
avatar
pjllaneras
Betatester

Cantidad de envíos : 569
Fecha de inscripción : 29/01/2009
Edad : 44
Localización : Palma de Mallorca

Ver perfil de usuario

Volver arriba Ir abajo

Re: Problemas con la compilacion

Mensaje por caparrut el Jue 11 Feb 2010 - 9:53

creo que lo conseguido un millon de gracias a todos
avatar
caparrut

Cantidad de envíos : 294
Fecha de inscripción : 14/11/2008
Localización : Muro de alcoy

Ver perfil de usuario

Volver arriba Ir abajo

Re: Problemas con la compilacion

Mensaje por pjllaneras el Jue 11 Feb 2010 - 13:36

caparrut escribió:creo que lo conseguido un millon de gracias a todos
Felicidades por tu primera compilación . Ahora verás que las próximas van a ser coser y cantar. Incluso hay un nuevo Interfaz gráfico que descarga del SVN y realiza la compilación:

http://vdr-m7x0.foroactivo.com.es/general-f8/gui-script-generacion-de-firmware-t881.htm
avatar
pjllaneras
Betatester

Cantidad de envíos : 569
Fecha de inscripción : 29/01/2009
Edad : 44
Localización : Palma de Mallorca

Ver perfil de usuario

Volver arriba Ir abajo

Re: Problemas con la compilacion

Mensaje por caparrut el Miér 14 Abr 2010 - 22:06

meda error 9 que puede ser gracias

touch /home/yo/VDR-NG-EM/VDR-NG-FW/downloads/cramfsswap_1.3.1.tar.gz
rm -rf /home/yo/VDR-NG-EM/VDR-NG-FW/hostutils.build/cramfsswap-1.3.1
tar -x -C /home/yo/VDR-NG-EM/VDR-NG-FW/hostutils.build -zf /home/yo/VDR-NG-EM/VDR-NG-FW/downloads/cramfsswap_1.3.1.tar.gz
touch /home/yo/VDR-NG-EM/VDR-NG-FW/m7x0_xtc_uclibc_Linux-i686/stagefiles/.cramfsswap_host_unpacked
for patch_file in `find /home/yo/VDR-NG-EM/VDR-NG-FW/patches/cramfsswap/1.3.1/host/Linux -type f -iname '*.patch' | sort` ; do patch -p1 -E -d /home/yo/VDR-NG-EM/VDR-NG-FW/hostutils.build/cramfsswap-1.3.1 < $patch_file ; done
touch /home/yo/VDR-NG-EM/VDR-NG-FW/m7x0_xtc_uclibc_Linux-i686/stagefiles/.cramfsswap_host_patched
make -C /home/yo/VDR-NG-EM/VDR-NG-FW/hostutils.build/cramfsswap-1.3.1 clean
make[1]: se ingresa al directorio `/home/yo/VDR-NG-EM/VDR-NG-FW/hostutils.build/cramfsswap-1.3.1'
rm -f cramfsswap
make[1]: se sale del directorio `/home/yo/VDR-NG-EM/VDR-NG-FW/hostutils.build/cramfsswap-1.3.1'
make -C /home/yo/VDR-NG-EM/VDR-NG-FW/hostutils.build/cramfsswap-1.3.1 all
make[1]: se ingresa al directorio `/home/yo/VDR-NG-EM/VDR-NG-FW/hostutils.build/cramfsswap-1.3.1'
gcc -Wall -g -O -o cramfsswap -lz cramfsswap.c
cramfsswap.c: In function ‘main’:
cramfsswap.c:337: warning: pointer targets in passing argument 2 of ‘crc32’ differ in signedness
/usr/include/zlib.h:1305: note: expected ‘const Bytef *’ but argument is of type ‘char *’
cramfsswap.c:112: warning: ignoring return value of ‘write’, declared with attribute warn_unused_result
cramfsswap.c:229: warning: ignoring return value of ‘write’, declared with attribute warn_unused_result
cramfsswap.c:237: warning: ignoring return value of ‘write’, declared with attribute warn_unused_result
cramfsswap.c:289: warning: ignoring return value of ‘write’, declared with attribute warn_unused_result
cramfsswap.c:315: warning: ignoring return value of ‘write’, declared with attribute warn_unused_result
cramfsswap.c:328: warning: ignoring return value of ‘write’, declared with attribute warn_unused_result
strip cramfsswap
make[1]: se sale del directorio `/home/yo/VDR-NG-EM/VDR-NG-FW/hostutils.build/cramfsswap-1.3.1'
touch /home/yo/VDR-NG-EM/VDR-NG-FW/m7x0_xtc_uclibc_Linux-i686/stagefiles/.cramfsswap_host_compiled
cp /home/yo/VDR-NG-EM/VDR-NG-FW/hostutils.build/cramfsswap-1.3.1/cramfsswap /home/yo/VDR-NG-EM/VDR-NG-FW/m7x0_xtc_uclibc_Linux-i686/bin/cramfsswap
rm -rf /home/yo/VDR-NG-EM/VDR-NG-FW/build/m7x0-modules
mkdir -p /home/yo/VDR-NG-EM/VDR-NG-FW/build/m7x0-modules
(cd /home/yo/VDR-NG-EM/VDR-NG-FW/build/m7x0-modules ; unzip -x /home/yo/VDR-NG-EM/VDR-NG-FW/downloads/fw-siemens-m740-2.4.zip)
Archive: /home/yo/VDR-NG-EM/VDR-NG-FW/downloads/fw-siemens-m740-2.4.zip
End-of-central-directory signature not found. Either this file is not
a zipfile, or it constitutes one disk of a multi-part archive. In the
latter case the central directory and zipfile comment will be found on
the last disk(s) of this archive.
unzip: cannot find zipfile directory in one of /home/yo/VDR-NG-EM/VDR-NG-FW/downloads/fw-siemens-m740-2.4.zip or
/home/yo/VDR-NG-EM/VDR-NG-FW/downloads/fw-siemens-m740-2.4.zip.zip, and cannot find /home/yo/VDR-NG-EM/VDR-NG-FW/downloads/fw-siemens-m740-2.4.zip.ZIP, period.
make: *** [/home/yo/VDR-NG-EM/VDR-NG-FW/m7x0_xtc_uclibc_Linux-i686/stagefiles/.m7x0-modules-m740_unpacked] Error 9
yo@yo-desktop:~/VDR-NG-EM/VDR-NG-FW$
avatar
caparrut

Cantidad de envíos : 294
Fecha de inscripción : 14/11/2008
Localización : Muro de alcoy

Ver perfil de usuario

Volver arriba Ir abajo

Re: Problemas con la compilacion

Mensaje por pjllaneras el Jue 15 Abr 2010 - 8:32

caparrut escribió:unzip: cannot find zipfile directory in one of /home/yo/VDR-NG-EM/VDR-NG-FW/downloads/fw-siemens-m740-2.4.zip or
/home/yo/VDR-NG-EM/VDR-NG-FW/downloads/fw-siemens-m740-2.4.zip.zip, and cannot find /home/yo/VDR-NG-EM/VDR-NG-FW/downloads/fw-siemens-m740-2.4.zip.ZIP, period.
make: *** [/home/yo/VDR-NG-EM/VDR-NG-FW/m7x0_xtc_uclibc_Linux-i686/stagefiles/.m7x0-modules-m740_unpacked] Error 9
yo@yo-desktop:~/VDR-NG-EM/VDR-NG-FW$

Por este error, yo diría que no ha encontrado el fichero "fw-siemens-m740-2.4.zip". ¿Volvemos a tener problemas para descargar el firmware de siemens?
avatar
pjllaneras
Betatester

Cantidad de envíos : 569
Fecha de inscripción : 29/01/2009
Edad : 44
Localización : Palma de Mallorca

Ver perfil de usuario

Volver arriba Ir abajo

Re: Problemas con la compilacion

Mensaje por bittor el Jue 15 Abr 2010 - 9:06

Borra el archivo downloads/fw-siemens-m740-2.4.zip y actualiza a la última versión del SVN porque ya está corregido.
avatar
bittor
Desarrollador

Cantidad de envíos : 3629
Fecha de inscripción : 25/06/2008
Localización : Zaragoza

Ver perfil de usuario http://bittor7x0.googlepages.com

Volver arriba Ir abajo

Re: Problemas con la compilacion

Mensaje por caparrut el Jue 15 Abr 2010 - 19:41

gracias lo probare
avatar
caparrut

Cantidad de envíos : 294
Fecha de inscripción : 14/11/2008
Localización : Muro de alcoy

Ver perfil de usuario

Volver arriba Ir abajo

Re: Problemas con la compilacion

Mensaje por caparrut el Mar 4 Mayo 2010 - 20:15

ayuda meda error 2 que sera gracias

rc=$?; \
$restore $backupdir/* `echo "./bfd.info" | sed 's|[^/]*$||'`; \
fi; \
rm -rf $backupdir; exit $rc
WARNING: `makeinfo' is missing on your system. You should only need it if
you modified a `.texi' or `.texinfo' file, or any other file
indirectly affecting the aspect of the manual. The spurious
call might also be the consequence of using a buggy `make' (AIX,
DU, IRIX). You might want to install the `Texinfo' package or
the `GNU make' package. Grab either from any GNU archive site.
make[4]: *** [bfd.info] Error 1
make[4]: se sale del directorio `/home/yo/VDR-NG-EM/VDR-NG-FW/build/binutils.build/bfd/doc'
Making info in po
make[4]: se ingresa al directorio `/home/yo/VDR-NG-EM/VDR-NG-FW/build/binutils.build/bfd/po'
( if test 'x/home/yo/VDR-NG-EM/VDR-NG-FW/build/binutils-2.20.1/bfd/po' != 'x.'; then \
posrcprefix='/home/yo/VDR-NG-EM/VDR-NG-FW/build/binutils-2.20.1/bfd/'; \
else \
posrcprefix="../"; \
fi; \
rm -f SRC-POTFILES-t SRC-POTFILES \
&& (sed -e '/^#/d' \
-e '/^[ ]*$/d' \
-e "s@.*@ $posrcprefix& \\\\@" < /home/yo/VDR-NG-EM/VDR-NG-FW/build/binutils-2.20.1/bfd/po/SRC-POTFILES.in \
| sed -e '$s/\\$//') > SRC-POTFILES-t \
&& chmod a-w SRC-POTFILES-t \
&& mv SRC-POTFILES-t SRC-POTFILES )
( rm -f BLD-POTFILES-t BLD-POTFILES \
&& (sed -e '/^#/d' \
-e '/^[ ]*$/d' \
-e "s@.*@ ../& \\\\@" < /home/yo/VDR-NG-EM/VDR-NG-FW/build/binutils-2.20.1/bfd/po/BLD-POTFILES.in \
| sed -e '$s/\\$//') > BLD-POTFILES-t \
&& chmod a-w BLD-POTFILES-t \
&& mv BLD-POTFILES-t BLD-POTFILES )
cd .. \
&& CONFIG_FILES=po/Makefile.in:po/Make-in \
CONFIG_HEADERS= /bin/sh ./config.status
config.status: creating po/Makefile.in
config.status: executing depfiles commands
config.status: executing libtool commands
config.status: executing default-1 commands
config.status: executing bfd_stdint.h commands
config.status: executing default commands
make[4]: se sale del directorio `/home/yo/VDR-NG-EM/VDR-NG-FW/build/binutils.build/bfd/po'
make[4]: se ingresa al directorio `/home/yo/VDR-NG-EM/VDR-NG-FW/build/binutils.build/bfd/po'
make[4]: No se hace nada para `info'.
make[4]: se sale del directorio `/home/yo/VDR-NG-EM/VDR-NG-FW/build/binutils.build/bfd/po'
make[4]: se ingresa al directorio `/home/yo/VDR-NG-EM/VDR-NG-FW/build/binutils.build/bfd'
make[4]: No se hace nada para `info-am'.
make[4]: se sale del directorio `/home/yo/VDR-NG-EM/VDR-NG-FW/build/binutils.build/bfd'
make[3]: *** [info-recursive] Error 1
make[3]: se sale del directorio `/home/yo/VDR-NG-EM/VDR-NG-FW/build/binutils.build/bfd'
make[2]: *** [all-bfd] Error 2
make[2]: se sale del directorio `/home/yo/VDR-NG-EM/VDR-NG-FW/build/binutils.build'
make[1]: *** [all] Error 2
make[1]: se sale del directorio `/home/yo/VDR-NG-EM/VDR-NG-FW/build/binutils.build'
make: *** [/home/yo/VDR-NG-EM/VDR-NG-FW/m7x0_xtc_uclibc_Linux-i686/stagefiles/.binutils_compiled] Error 2
yo@yo-desktop:~/VDR-NG-EM/VDR-NG-FW$
avatar
caparrut

Cantidad de envíos : 294
Fecha de inscripción : 14/11/2008
Localización : Muro de alcoy

Ver perfil de usuario

Volver arriba Ir abajo

Re: Problemas con la compilacion

Mensaje por bittor el Miér 5 Mayo 2010 - 9:23

Prueba a ejecutar un ./make-fw que te limpiará y actualizará todo lo que tengas.
Si te sigue sin funcionar, mira en la wiki los paquetes que hay que instalar.
avatar
bittor
Desarrollador

Cantidad de envíos : 3629
Fecha de inscripción : 25/06/2008
Localización : Zaragoza

Ver perfil de usuario http://bittor7x0.googlepages.com

Volver arriba Ir abajo

Re: Problemas con la compilacion

Mensaje por caparrut el Miér 5 Mayo 2010 - 20:01

sigue dando el mismo error, y los paquetes de la wiki son estos *
gcc-3.4-base_3.4.6-9_i386.deb
* cpp-3.4_3.4.6-9_i386.deb
* gcc-3.4_3.4.6-9_i386.deb
no, o hay mas,gracias por contestar
avatar
caparrut

Cantidad de envíos : 294
Fecha de inscripción : 14/11/2008
Localización : Muro de alcoy

Ver perfil de usuario

Volver arriba Ir abajo

Re: Problemas con la compilacion

Mensaje por Contenido patrocinado


Contenido patrocinado


Volver arriba Ir abajo

Página 4 de 5. Precedente  1, 2, 3, 4, 5  Siguiente

Ver el tema anterior Ver el tema siguiente Volver arriba


 
Permisos de este foro:
No puedes responder a temas en este foro.